BDBM50025517 3-Hydroxy-6-methyl-4-{3-methyl-2-[3-methyl-2-(3-methyl-butyrylamino)-butyrylamino]-butyrylamino}-heptanoic acid ethyl ester::CHEMBL433050
SMILES CCOC(=O)C[C@H](O)[C@H](CC(C)C)NC(=O)[C@@H](NC(=O)[C@@H](NC(=O)CC(C)C)C(C)C)C(C)C
InChI Key InChIKey=SMVMSLPPAGGLDL-PWIBJQSTSA-N
Data  2 KI
PDB links: 1 PDB ID matches this monomer.
  Tab Delimited (TSV)   2D SDfile   Computed 3D by Vconf -m prep SDfile
Find this compound or compounds like it in BindingDB:
Activity Spreadsheet -- Enzyme Inhibition Constant Data from BindingDB
Found 1 hit for monomerid = 50025517
TargetPepsin A(Porcine)
TBA
Curated by ChEMBL
LigandPNGBDBM50025517(3-Hydroxy-6-methyl-4-{3-methyl-2-[3-methyl-2-(3-me...)
Affinity DataKi:  10nM. Assay description: Tested for time independent inhibition constant against porcine pepsin
In DepthDetails ArticlePubMed